arm-none-eabi-gcc -nostartfiles -Os -mcpu=cortex-m4 -mthumb -mfloat-abi=hard -mfpu=fpv4-sp-d16 -Wl,--gc-sections -T../ld/LPC4330_M4_memory.ld  -T../ld/app.ld -Wl,-Map=camp.map -o camp.elf  ../rad1olib/setup.o ../r0ketlib/display.o ../r0ketlib/render.o ../r0ketlib/fonts/smallfonts.o ../r0ketlib/fonts/orbitron14.o ../r0ketlib/fonts/ubuntu18.o ../r0ketlib/decoder.o ../r0ketlib/print.o ../r0ketlib/itoa.o ../r0ketlib/keyin.o ../r0ketlib/menu.o ../r0ketlib/mesh.o ../rad1olib/spi-flash.o ../rad1olib/assert.o ../rad1olib/systick.o ../hackrf/firmware/common/si5351c.o ../fatfs/diskio.o ../fatfs/ff.o ../r0ketlib/select.o ../r0ketlib/idle.o ../r0ketlib/fs_util.o ../r0ketlib/execute.o ../r0ketlib/config.o ../r0ketlib/stringin.o ../r0ketlib/colorin.o ../r0ketlib/random.o ../r0ketlib/image.o ../r0ketlib/night.o ../lpcapi/msc/msc_desc.o ../lpcapi/msc/msc_main.o ../lpcapi/msc/msc_ram.o ../lpcapi/usbd_common.o  ../hackrf/firmware/common/usb.o ../lpcapi/cdc/cdc_desc.o ../lpcapi/cdc/cdc_main.o ../lpcapi/cdc/cdc_vcom.o ../rad1olib/light_ws2812_cortex.o ../rad1olib/battery.o ../rad1olib/draw.o ../hackrf/firmware/common/xapp058/micro.o ../hackrf/firmware/common/xapp058/ports.o ../hackrf/firmware/common/xapp058/lenval.o ../hackrf/firmware/common/cpld_jtag.o rgb_leds.o exe.o util.o main.o nickname.o rad1oconfig.o ../hackrf/firmware/common/w25q80bv.o ../hackrf/firmware/common/max2871.o ../l0dables/jumptable.o  -L../libopencm3/lib -lopencm3_lpc43xx -lc -lm
main.o: In function `sys_tick_handler':
/home/kaback/GITROOT/rad1o/f1rmware/campapp/main.c:118: undefined reference to `generated_tick'
main.o: In function `main':
/home/kaback/GITROOT/rad1o/f1rmware/campapp/main.c:153: undefined reference to `generated_init'
collect2: error: ld returned 1 exit status
../Makefile.inc:75: recipe for target 'camp.elf' failed
make[1]: *** [camp.elf] Error 1
make[1]: Leaving directory '/home/kaback/GITROOT/rad1o/f1rmware/campapp'
Makefile:8: recipe for target 'subdirs' failed
make: *** [subdirs] Error 2